{"text_format":"1","workbook":"xlsx","n_sheets":5,"sheets":["Rev Log","Start","Calculator","Final","log"],"not_rendered":{"charts":0,"images":2,"macros":1,"external_links":0,"defined_names":57,"comments":0,"pivot_tables":0},"unopened":[],"bounds":{"document_bytes":16777216,"sheet_cells":100000,"rows_first":2000,"rows_last":500,"rows_between":2000,"halvings":0,"cell_chars":16384,"cell_head_chars":4096},"cells_cut":0,"cells_raw":0,"read":"whole","date_system":"1900"}

{"sheet":"Rev Log","index":0,"n_rows":6,"n_cols":9,"rows_kept":6,"cut":false,"hidden":true,"merged":[[0,0,0,4]]}
["Revision Log",null,null,null,null,null,null,{"$f":"LOOKUP(2,1/(A:A<>\"\"),A:A)","v":"09.13.2022"},{"$f":"LOOKUP(2,1/(B:B<>\"\"),B:B)","v":1.04}]
["Date","Version #","Issue","Fix","Done by:"]
["03.15.2022",1.01,"Launch",null,"Meagan Magnin"]
["03.15.2022",1.02,"Rental hours not showing correctly on final sheet","fixed the formulas on the final sheet and where it pulls from log","Meagan Magnin"]
["04.04.2022",1.03,"64 bit system not working with calculator","Added PtrSafe to Declare statement on Module 4","Meagan Magnin"]
["09.13.2022",1.04,"Grammar and verbiage edits","Grammar and verbiage edited, Total Rental Hours on Final sheet moved to top.","Christopher Gauger"]

{"sheet":"Start","index":1,"n_rows":34,"n_cols":3,"rows_kept":34,"cut":false,"hidden":false,"merged":[[3,0,3,2],[2,0,2,2],[4,0,4,2],[0,0,0,2],[8,0,8,2]]}
[]
[]
["Welcome"]
["Welcome to the EAA Flight Training Cost Calculator."]
["This tool is available to help you estimate the cost of your flight training."]
[]
[]
["For Best Results"]
["We recommend the user to have discussions with all potential flight instructors or flight training providers to discuss how many hours of dual instruction can be expected. This number can vary greatly depending on each participant’s situation and on the flight school’s business model.\nIt is also important to discuss with each potential instructor if one-on-one student/instructor discussion is included pre- and post-flight at no charge, or if an hourly rate is charged, as this can vary. It is important to have a clear understanding of what is and what is not included in a flight training curriculum."]
[]
["How to Use"]
["Begin by launching the tool by clicking the “Launch Calculator” button."]
["Fill in every cell with the appropriate numbers."]
["If any section or line item is not significant, simply skip it, or enter the digit “0”."]
["When completed, click “Submit” and name the document for future reference."]
["Review the results. Note that the results are saved in a tab at the bottom of the spreadsheet."]
["To edit an existing form, click “Relaunch Calculator”, then click \"Load Previous Costs\" "]
["Revise previous costs and \"Submit\" new calculation."]
["To clear all cells and start a new scenario, click “Relaunch Calculator”."]
[]
[]
["Naming Your Cost Scenario Sheets"]
["When naming your cost scenario sheets, use a “name” or a “string”, and do not use digits only."]
["You may use:",null,"Do not use:"]
["“One”, “1_One”, “One1”, or “1One”",null,"“1” or “11”, etc."]
[" 3.2.22;  3_2_22; or  Mar 2, 2022",null,"a slash “/”   i.e. 3/2/22"]
[]
[]
[]
[]
[]
[]
[]
[{"$f":"CONCATENATE(\"Version\",\" \",'Rev Log'!I1)","v":"Version 1.04"},null,{"$f":"'Rev Log'!H1","v":"09.13.2022"}]

{"sheet":"Calculator","index":2,"n_rows":33,"n_cols":8,"rows_kept":33,"cut":false,"hidden":true,"merged":[[24,3,24,4],[14,0,14,1],[16,6,17,7],[19,3,19,4],[19,6,19,7],[20,0,20,1],[21,0,21,1],[3,6,3,7],[6,6,6,7],[13,3,13,4],[0,0,0,4],[1,0,1,4],[3,0,3,1],[3,3,3,4],[7,6,7,7],[8,3,8,4],[9,0,9,1],[10,6,10,7],[11,0,12,1]]}
["EAA Ray Aviation Scholarship"]
["Scholar Flight Training Costs Calculator"]
[]
["Flight School or Flying Club Dues",null,null,"Flight Instructor Fees",null,null,"Flight Training Costs"]
["Initial Join Fee",null,null,"Rate",null,null,"TOTAL",{"$f":"B8+E7+E12+E18+B18+E33+E23+B11","v":584}]
["Number of Months",null,null,"Hours"]
["Monthly Dues",null,null,"TOTAL",{"$f":"E6*E5","v":0},null,"Flight Training Costs"]
["TOTAL",{"$f":"B5+(B6*B7)","v":0},null,null,null,null,"(Covered by Ray Scholarship)"]
[null,null,null,"Aircraft Rental Costs",null,null,"TOTAL",{"$f":"B8+E7+E12+E18+B18+E23","v":584}]
["Medical Exam*",null,null,"Rate",9]
["Exam",null,null,"Hours",8,null,"Funding Sources"]
["*Not required for Sport Pilot or Glider Pilot certificates.",null,null,"TOTAL",{"$f":"E11*E10","v":72},null,"Ray Scholarship"]
[null,null,null,null,null,null,"Chapter Funds*"]
[null,null,null,"Fuel Costs",null,null,"Other Scholarships"]
["Non-Owner Insurance",null,null,"Cost/Gallon",8,null,"Personal Funds"]
["Rate",null,null,"Gallons/Hour",8,null,"TOTAL",{"$f":"SUM(H12:H15)","v":0}]
["Number of Months",null,null,"Flight Hours",{"$f":"section1d","v":8},null,"*May include chapter portion of 50/50 Ray Scholarships."]
["TOTAL",{"$f":"B16*B17","v":0},null,"TOTAL",{"$f":"E15*E16*E17","v":512}]
[]
[null,null,null,"Flight Testing",null,null,"Balance"]
["Cells in blue are editable.",null,null,"Written Exam",null,null,"Funding Sources",{"$f":"H16","v":0}]
["Not covered by Ray Scholarship.",null,null,"Checkride",null,null,"Flight Training Costs",{"$f":"H5","v":584}]
[null,null,null,"TOTAL",{"$f":"SUM(E21:E22)","v":0},null,"Surplus or (Deficit)",{"$f":"H21-H22","v":-584}]
[]
[null,null,null,"Supplies"]
[null,null,null,"Books"]
[null,null,null,"Charts"]
[null,null,null,"E6B"]
[null,null,null,"Headset"]
[null,null,null,"Kneeboard"]
[null,null,null,"Logbook"]
[null,null,null,"Other"]
[null,null,null,"TOTAL",{"$f":"SUM(E26:E32)","v":0}]

{"sheet":"Final","index":3,"n_rows":22,"n_cols":17,"rows_kept":22,"cut":false,"hidden":true,"merged":[[17,0,17,1],[18,0,18,1],[10,0,10,1],[4,0,6,2],[14,0,14,1],[12,0,12,1],[11,0,11,1],[8,0,8,1],[13,0,13,1],[7,0,7,1],[9,0,9,1],[15,0,15,1],[16,0,16,1]]}
[null,null,null,null,null,null,null,null,null,null,null,null,null,null,null,null,"test"]
[]
[]
[]
["EAA Flight Training Cost Calculator"]
[]
[]
["Total Rental Hours",null,{"$f":"VLOOKUP(TName, log!A1:AO999,5,FALSE)","v":{"$error":"#N/A"}}]
["Aircraft Rental Associated Rates",null,{"$f":"VLOOKUP(TName, log!A1:AO999,34,FALSE)","v":{"$error":"#N/A"}}]
["Total Fuel Costs",null,{"$f":"VLOOKUP(TName, log!A1:AO999,35,FALSE)","v":{"$error":"#N/A"}}]
["Flight School or Flying Club Dues",null,{"$f":"VLOOKUP(TName, log!A1:AO999,30,FALSE)","v":{"$error":"#N/A"}}]
["Flight Instruction & Ground School",null,{"$f":"VLOOKUP(TName, log!A1:AO999,33,FALSE)","v":{"$error":"#N/A"}}]
["Non-Owner Insurance",null,{"$f":"VLOOKUP(TName, log!A1:AO999,32,FALSE)","v":{"$error":"#N/A"}}]
["Supplies & Materials",null,{"$f":"VLOOKUP(TName, log!A1:AO999,37,FALSE)","v":{"$error":"#N/A"}}]
["Medical Exam*",null,{"$f":"VLOOKUP(TName, log!A1:AO999,31,FALSE)","v":{"$error":"#N/A"}}]
["Flight Testing (i.e. written exam + checkride)",null,{"$f":"VLOOKUP(TName, log!A1:AO999,36,FALSE)","v":{"$error":"#N/A"}}]
["Funding Sources",null,{"$f":"VLOOKUP(TName, log!A1:AO999,38,FALSE)","v":{"$error":"#N/A"}}]
["Flight Training Costs",null,{"$f":"VLOOKUP(TName, log!A1:AO999,39,FALSE)","v":{"$error":"#N/A"}}]
["Surplus or (Deficit)",null,{"$f":"VLOOKUP(TName, log!A1:AO999,41,FALSE)","v":{"$error":"#N/A"}}]
[]
["*Not required for Sport Pilot or Glider Pilot Certificates"]
["Not covered by EAA Ray Scholarship"]

{"sheet":"log","index":4,"n_rows":999,"n_cols":41,"rows_kept":999,"cut":false,"hidden":true,"merged":[]}
["Page name","1a","1b","1c","1d","2a","2b","2c","3a","3b","3c","3d","4a","4b","5a","5b","5c","5d","5e","5f","5g","5h","6a","6b","6c","7a","7b","7c","7d","Dues","Medical","Ins","Inst Fees","Rental","fuel","testing","supplies","Funds","Total costs","total for Ray","Over/under"]
[null,null,null,null,null,null,null,null,null,null,null,null,null,null,null,null,null,null,null,null,null,null,null,null,null,null,null,null,null,{"$f":"F2+(G2*H2)","v":0},{"$f":"W2","v":0},{"$f":"M2*N2","v":0},{"$f":"SUM(I2*J2)+K2+L2","v":0},{"$f":"B2*E2","v":0},{"$f":"D2*C2*E2","v":0},{"$f":"X2+Y2","v":0},{"$f":"O2+P2+Q2+R2+S2+T2+U2+V2","v":0},{"$f":"Z2+AA2+AB2+AC2","v":0},{"$f":"AD2+AE2+AF2+AG2+AH2+AI2+AJ2+AK2","v":0},{"$f":"AD2+AF2+AG2+AH2+AI2+AJ2","v":0},{"$f":"AL2-AM2","v":0}]
[null,null,null,null,null,null,null,null,null,null,null,null,null,null,null,null,null,null,null,null,null,null,null,null,null,null,null,null,null,{"$f":"F3+(G3*H3)","v":0},{"$f":"W3","v":0},{"$f":"M3*N3","v":0},{"$f":"SUM(I3*J3)+K3+L3","v":0},{"$f":"B3*E3","v":0},{"$f":"D3*C3*E3","v":0},{"$f":"X3+Y3","v":0},{"$f":"O3+P3+Q3+R3+S3+T3+U3","v":0},{"$f":"Z3+AA3+AB3+AC3","v":0},{"$f":"AD3+AE3+AF3+AG3+AH3+AI3+AJ3+AK3","v":0},{"$f":"AD3+AF3+AG3+AH3+AI3+AJ3","v":0},{"$f":"AL3-AM3","v":0}]
[null,null,null,null,null,null,null,null,null,null,null,null,null,null,null,null,null,null,null,null,null,null,null,null,null,null,null,null,null,{"$f":"F4+(G4*H4)","v":0},{"$f":"W4","v":0},{"$f":"M4*N4","v":0},{"$f":"SUM(I4*J4)+K4+L4","v":0},{"$f":"B4*E4","v":0},{"$f":"D4*C4*E4","v":0},{"$f":"X4+Y4","v":0},{"$f":"O4+P4+Q4+R4+S4+T4+U4","v":0},{"$f":"Z4+AA4+AB4+AC4","v":0},{"$f":"AD4+AE4+AF4+AG4+AH4+AI4+AJ4+AK4","v":0},{"$f":"AD4+AF4+AG4+AH4+AI4+AJ4","v":0},{"$f":"AL4-AM4","v":0}]
[null,null,null,null,null,null,null,null,null,null,null,null,null,null,null,null,null,null,null,null,null,null,null,null,null,null,null,null,null,0,0,{"$f":"M5*N5","v":0},0,0,0,0,0,0,0,0,0]
[null,null,null,null,null,null,null,null,null,null,null,null,null,null,null,null,null,null,null,null,null,null,null,null,null,null,null,null,null,0,0,0,0,0,0,0,0,0,0,0,0]
[null,null,null,null,null,null,null,null,null,null,null,null,null,null,null,null,null,null,null,null,null,null,null,null,null,null,null,null,null,0,0,0,0,0,0,0,0,0,0,0,0]
[null,null,null,null,null,null,null,null,null,null,null,null,null,null,null,null,null,null,null,null,null,null,null,null,null,null,null,null,null,0,0,0,0,0,0,0,0,0,0,0,0]
[null,null,null,null,null,null,null,null,null,null,null,null,null,null,null,null,null,null,null,null,null,null,null,null,null,null,null,null,null,0,0,0,0,0,0,0,0,0,0,0,0]
[null,null,null,null,null,null,null,null,null,null,null,null,null,null,null,null,null,null,null,null,null,null,null,null,null,null,null,null,null,0,0,0,0,0,0,0,0,0,0,0,0]
[null,null,null,null,null,null,null,null,null,null,null,null,null,null,null,null,null,null,null,null,null,null,null,null,null,null,null,null,null,0,0,0,0,0,0,0,0,0,0,0,0]
[null,null,null,null,null,null,null,null,null,null,null,null,null,null,null,null,null,null,null,null,null,null,null,null,null,null,null,null,null,0,0,0,0,0,0,0,0,0,0,0,0]
[null,null,null,null,null,null,null,null,null,null,null,null,null,null,null,null,null,null,null,null,null,null,null,null,null,null,null,null,null,0,0,0,0,0,0,0,0,0,0,0,0]
[null,null,null,null,null,null,null,null,null,null,null,null,null,null,null,null,null,null,null,null,null,null,null,null,null,null,null,null,null,0,0,0,0,0,0,0,0,0,0,0,0]
[null,null,null,null,null,null,null,null,null,null,null,null,null,null,null,null,null,null,null,null,null,null,null,null,null,null,null,null,null,0,0,0,0,0,0,0,0,0,0,0,0]
[null,null,null,null,null,null,null,null,null,null,null,null,null,null,null,null,null,null,null,null,null,null,null,null,null,null,null,null,null,0,0,0,0,0,0,0,0,0,0,0,0]
[null,null,null,null,null,null,null,null,null,null,null,null,null,null,null,null,null,null,null,null,null,null,null,null,null,null,null,null,null,0,0,0,0,0,0,0,0,0,0,0,0]
[null,null,null,null,null,null,null,null,null,null,null,null,null,null,null,null,null,null,null,null,null,null,null,null,null,null,null,null,null,0,0,0,0,0,0,0,0,0,0,0,0]
[null,null,null,null,null,null,null,null,null,null,null,null,null,null,null,null,null,null,null,null,null,null,null,null,null,null,null,null,null,0,0,0,0,0,0,0,0,0,0,0,0]
[null,null,null,null,null,null,null,null,null,null,null,null,null,null,null,null,null,null,null,null,null,null,null,null,null,null,null,null,null,0,0,0,0,0,0,0,0,0,0,0,0]
[null,null,null,null,null,null,null,null,null,null,null,null,null,null,null,null,null,null,null,null,null,null,null,null,null,null,null,null,null,0,0,0,0,0,0,0,0,0,0,0,0]
[null,null,null,null,null,null,null,null,null,null,null,null,null,null,null,null,null,null,null,null,null,null,null,null,null,null,null,null,null,0,0,0,0,0,0,0,0,0,0,0,0]
[null,null,null,null,null,null,null,null,null,null,null,null,null,null,null,null,null,null,null,null,null,null,null,null,null,null,null,null,null,0,0,0,0,0,0,0,0,0,0,0,0]
[null,null,null,null,null,null,null,null,null,null,null,null,null,null,null,null,null,null,null,null,null,null,null,null,null,null,null,null,null,0,0,0,0,0,0,0,0,0,0,0,0]
[null,null,null,null,null,null,null,null,null,null,null,null,null,null,null,null,null,null,null,null,null,null,null,null,null,null,null,null,null,0,0,0,0,0,0,0,0,0,0,0,0]
[null,null,null,null,null,null,null,null,null,null,null,null,null,null,null,null,null,null,null,null,null,null,null,null,null,null,null,null,null,0,0,0,0,0,0,0,0,0,0,0,0]
[null,null,null,null,null,null,null,null,null,null,null,null,null,null,null,null,null,null,null,null,null,null,null,null,null,null,null,null,null,0,0,0,0,0,0,0,0,0,0,0,0]
[null,null,null,null,null,null,null,null,null,null,null,null,null,null,null,null,null,null,null,null,null,null,null,null,null,null,null,null,null,0,0,0,0,0,0,0,0,0,0,0,0]
[null,null,null,null,null,null,null,null,null,null,null,null,null,null,null,null,null,null,null,null,null,null,null,null,null,null,null,null,null,0,0,0,0,0,0,0,0,0,0,0,0]
[null,null,null,null,null,null,null,null,null,null,null,null,null,null,null,null,null,null,null,null,null,null,null,null,null,null,null,null,null,0,0,0,0,0,0,0,0,0,0,0,0]
[null,null,null,null,null,null,null,null,null,null,null,null,null,null,null,null,null,null,null,null,null,null,null,null,null,null,null,null,null,0,0,0,0,0,0,0,0,0,0,0,0]
[null,null,null,null,null,null,null,null,null,null,null,null,null,null,null,null,null,null,null,null,null,null,null,null,null,null,null,null,null,0,0,0,0,0,0,0,0,0,0,0,0]
[null,null,null,null,null,null,null,null,null,null,null,null,null,null,null,null,null,null,null,null,null,null,null,null,null,null,null,null,null,0,0,0,0,0,0,0,0,0,0,0,0]
[null,null,null,null,null,null,null,null,null,null,null,null,null,null,null,null,null,null,null,null,null,null,null,null,null,null,null,null,null,0,0,0,0,0,0,0,0,0,0,0,0]
[null,null,null,null,null,null,null,null,null,null,null,null,null,null,null,null,null,null,null,null,null,null,null,null,null,null,null,null,null,0,0,0,0,0,0,0,0,0,0,0,0]
[null,null,null,null,null,null,null,null,null,null,null,null,null,null,null,null,null,null,null,null,null,null,null,null,null,null,null,null,null,0,0,0,0,0,0,0,0,0,0,0,0]
[null,null,null,null,null,null,null,null,null,null,null,null,null,null,null,null,null,null,null,null,null,null,null,null,null,null,null,null,null,0,0,0,0,0,0,0,0,0,0,0,0]
[null,null,null,null,null,null,null,null,null,null,null,null,null,null,null,null,null,null,null,null,null,null,null,null,null,null,null,null,null,0,0,0,0,0,0,0,0,0,0,0,0]
[null,null,null,null,null,null,null,null,null,null,null,null,null,null,null,null,null,null,null,null,null,null,null,null,null,null,null,null,null,0,0,0,0,0,0,0,0,0,0,0,0]
[null,null,null,null,null,null,null,null,null,null,null,null,null,null,null,null,null,null,null,null,null,null,null,null,null,null,null,null,null,0,0,0,0,0,0,0,0,0,0,0,0]
[null,null,null,null,null,null,null,null,null,null,null,null,null,null,null,null,null,null,null,null,null,null,null,null,null,null,null,null,null,0,0,0,0,0,0,0,0,0,0,0,0]
[null,null,null,null,null,null,null,null,null,null,null,null,null,null,null,null,null,null,null,null,null,null,null,null,null,null,null,null,null,0,0,0,0,0,0,0,0,0,0,0,0]
[null,null,null,null,null,null,null,null,null,null,null,null,null,null,null,null,null,null,null,null,null,null,null,null,null,null,null,null,null,0,0,0,0,0,0,0,0,0,0,0,0]
[null,null,null,null,null,null,null,null,null,null,null,null,null,null,null,null,null,null,null,null,null,null,null,null,null,null,null,null,null,0,0,0,0,0,0,0,0,0,0,0,0]
[null,null,null,null,null,null,null,null,null,null,null,null,null,null,null,null,null,null,null,null,null,null,null,null,null,null,null,null,null,0,0,0,0,0,0,0,0,0,0,0,0]
[null,null,null,null,null,null,null,null,null,null,null,null,null,null,null,null,null,null,null,null,null,null,null,null,null,null,null,null,null,0,0,0,0,0,0,0,0,0,0,0,0]
[null,null,null,null,null,null,null,null,null,null,null,null,null,null,null,null,null,null,null,null,null,null,null,null,null,null,null,null,null,0,0,0,0,0,0,0,0,0,0,0,0]
[null,null,null,null,null,null,null,null,null,null,null,null,null,null,null,null,null,null,null,null,null,null,null,null,null,null,null,null,null,0,0,0,0,0,0,0,0,0,0,0,0]
[null,null,null,null,null,null,null,null,null,null,null,null,null,null,null,null,null,null,null,null,null,null,null,null,null,null,null,null,null,0,0,0,0,0,0,0,0,0,0,0,0]
[null,null,null,null,null,null,null,null,null,null,null,null,null,null,null,null,null,null,null,null,null,null,null,null,null,null,null,null,null,0,0,0,0,0,0,0,0,0,0,0,0]
[null,null,null,null,null,null,null,null,null,null,null,null,null,null,null,null,null,null,null,null,null,null,null,null,null,null,null,null,null,0,0,0,0,0,0,0,0,0,0,0,0]
[null,null,null,null,null,null,null,null,null,null,null,null,null,null,null,null,null,null,null,null,null,null,null,null,null,null,null,null,null,0,0,0,0,0,0,0,0,0,0,0,0]
[null,null,null,null,null,null,null,null,null,null,null,null,null,null,null,null,null,null,null,null,null,null,null,null,null,null,null,null,null,0,0,0,0,0,0,0,0,0,0,0,0]
[null,null,null,null,null,null,null,null,null,null,null,null,null,null,null,null,null,null,null,null,null,null,null,null,null,null,null,null,null,0,0,0,0,0,0,0,0,0,0,0,0]
[null,null,null,null,null,null,null,null,null,null,null,null,null,null,null,null,null,null,null,null,null,null,null,null,null,null,null,null,null,0,0,0,0,0,0,0,0,0,0,0,0]
[null,null,null,null,null,null,null,null,null,null,null,null,null,null,null,null,null,null,null,null,null,null,null,null,null,null,null,null,null,0,0,0,0,0,0,0,0,0,0,0,0]
[null,null,null,null,null,null,null,null,null,null,null,null,null,null,null,null,null,null,null,null,null,null,null,null,null,null,null,null,null,0,0,0,0,0,0,0,0,0,0,0,0]
[null,null,null,null,null,null,null,null,null,null,null,null,null,null,null,null,null,null,null,null,null,null,null,null,null,null,null,null,null,0,0,0,0,0,0,0,0,0,0,0,0]
[null,null,null,null,null,null,null,null,null,null,null,null,null,null,null,null,null,null,null,null,null,null,null,null,null,null,null,null,null,0,0,0,0,0,0,0,0,0,0,0,0]
[null,null,null,null,null,null,null,null,null,null,null,null,null,null,null,null,null,null,null,null,null,null,null,null,null,null,null,null,null,0,0,0,0,0,0,0,0,0,0,0,0]
[null,null,null,null,null,null,null,null,null,null,null,null,null,null,null,null,null,null,null,null,null,null,null,null,null,null,null,null,null,0,0,0,0,0,0,0,0,0,0,0,0]
[null,null,null,null,null,null,null,null,null,null,null,null,null,null,null,null,null,null,null,null,null,null,null,null,null,null,null,null,null,0,0,0,0,0,0,0,0,0,0,0,0]
[null,null,null,null,null,null,null,null,null,null,null,null,null,null,null,null,null,null,null,null,null,null,null,null,null,null,null,null,null,0,0,0,0,0,0,0,0,0,0,0,0]
[null,null,null,null,null,null,null,null,null,null,null,null,null,null,null,null,null,null,null,null,null,null,null,null,null,null,null,null,null,0,0,0,0,0,0,0,0,0,0,0,0]
[null,null,null,null,null,null,null,null,null,null,null,null,null,null,null,null,null,null,null,null,null,null,null,null,null,null,null,null,null,0,0,0,0,0,0,0,0,0,0,0,0]
[null,null,null,null,null,null,null,null,null,null,null,null,null,null,null,null,null,null,null,null,null,null,null,null,null,null,null,null,null,{"$f":"F66+(G66*H66)","v":0},{"$f":"W66","v":0},{"$f":"M66*N66","v":0},{"$f":"SUM(I66*J66)+K66+L66","v":0},{"$f":"B66*E66","v":0},{"$f":"D66*C66*E66","v":0},{"$f":"X66+Y66","v":0},{"$f":"O66+P66+Q66+R66+S66+T66+U66","v":0},{"$f":"Z66+AA66+AB66+AC66","v":0},{"$f":"AD66+AE66+AF66+AG66+AH66+AI66+AJ66+AK66","v":0},{"$f":"AD66+AF66+AG66+AH66+AI66+AJ66","v":0},{"$f":"AL66-AM66","v":0}]
[null,null,null,null,null,null,null,null,null,null,null,null,null,null,null,null,null,null,null,null,null,null,null,null,null,null,null,null,null,0,0,0,0,0,0,0,0,0,0,0,0]
[null,null,null,null,null,null,null,null,null,null,null,null,null,null,null,null,null,null,null,null,null,null,null,null,null,null,null,null,null,0,0,0,0,0,0,0,0,0,0,0,0]
[null,null,null,null,null,null,null,null,null,null,null,null,null,null,null,null,null,null,null,null,null,null,null,null,null,null,null,null,null,0,0,0,0,0,0,0,0,0,0,0,0]
[null,null,null,null,null,null,null,null,null,null,null,null,null,null,null,null,null,null,null,null,null,null,null,null,null,null,null,null,null,0,0,0,0,0,0,0,0,0,0,0,0]
[null,null,null,null,null,null,null,null,null,null,null,null,null,null,null,null,null,null,null,null,null,null,null,null,null,null,null,null,null,0,0,0,0,0,0,0,0,0,0,0,0]
[null,null,null,null,null,null,null,null,null,null,null,null,null,null,null,null,null,null,null,null,null,null,null,null,null,null,null,null,null,0,0,0,0,0,0,0,0,0,0,0,0]
[null,null,null,null,null,null,null,null,null,null,null,null,null,null,null,null,null,null,null,null,null,null,null,null,null,null,null,null,null,0,0,0,0,0,0,0,0,0,0,0,0]
[null,null,null,null,null,null,null,null,null,null,null,null,null,null,null,null,null,null,null,null,null,null,null,null,null,null,null,null,null,0,0,0,0,0,0,0,0,0,0,0,0]
[null,null,null,null,null,null,null,null,null,null,null,null,null,null,null,null,null,null,null,null,null,null,null,null,null,null,null,null,null,0,0,0,0,0,0,0,0,0,0,0,0]
[null,null,null,null,null,null,null,null,null,null,null,null,null,null,null,null,null,null,null,null,null,null,null,null,null,null,null,null,null,0,0,0,0,0,0,0,0,0,0,0,0]
[null,null,null,null,null,null,null,null,null,null,null,null,null,null,null,null,null,null,null,null,null,null,null,null,null,null,null,null,null,0,0,0,0,0,0,0,0,0,0,0,0]
[null,null,null,null,null,null,null,null,null,null,null,null,null,null,null,null,null,null,null,null,null,null,null,null,null,null,null,null,null,0,0,0,0,0,0,0,0,0,0,0,0]
[null,null,null,null,null,null,null,null,null,null,null,null,null,null,null,null,null,null,null,null,null,null,null,null,null,null,null,null,null,0,0,0,0,0,0,0,0,0,0,0,0]
[null,null,null,null,null,null,null,null,null,null,null,null,null,null,null,null,null,null,null,null,null,null,null,null,null,null,null,null,null,0,0,0,0,0,0,0,0,0,0,0,0]
{"$rows_left_out":919}